{"text_format":"1","workbook":"xlsx","n_sheets":14,"sheets":["Main Dashboard","AS Reference Sheet","Teachers","Diploma Educators","Teacher Index","Cert III Educators","Activity Group Leaders","Other Staff","Holiday Programs","Day Care Programs","Budget","Profile","Grants","2025 Funding Rates"],"not_rendered":{"charts":0,"images":1,"macros":1,"external_links":0,"defined_names":16,"comments":11,"pivot_tables":0},"unopened":[],"bounds":{"document_bytes":16777216,"sheet_cells":100000,"rows_first":2000,"rows_last":500,"rows_between":2000,"halvings":0,"cell_chars":16384,"cell_head_chars":4096},"cells_cut":0,"cells_raw":0,"read":"whole","date_system":"1900"}

{"sheet":"Main Dashboard","index":0,"n_rows":35,"n_cols":8,"rows_kept":35,"cut":false,"hidden":false,"merged":[]}
[]
[null,null,"   Member Service Financial Budgeting Tools",null,null,null,null,"2023-10-26"]
[]
[]
[null,"Service Name:",null,null,"Weeks in Period:"]
[]
[null,"For Period / FY Beginning:",null,null,"Term Weeks in Period:"]
[]
[]
[null,"EMPLOYEE DATA:"]
[]
[]
[]
[]
[]
{"$rows_left_out":21}
{"sheet":"AS Reference Sheet","index":1,"n_rows":28,"n_cols":5,"rows_kept":28,"cut":false,"hidden":true,"merged":[]}
["Sheet","Reference","Type","Value"]
["Teachers","Row 16","Criteria Value",25.5,"Max Contact Hours for Teachers"]
["Teachers","Row 16","Output Value",38,"Max Hours per week"]
["Teachers","Row 16","Calculation Value",4]
["Teachers","Row 16","Calculation Value",60,"Hour value"]
["Teacher Index","Row 10","Calculation Value","765/38","Max Work Load Index for Teachers / Max Hours per Week"]
["Diploma Educators","Row 17","Criteria Value",30.4,"Max Contact Hours for Diploma Educators"]
["Diploma Educators","Row 17","Output Value",38,"Max Hours per week"]
["Diploma Educators","Row 17","Calculation Value",4]
["Diploma Educators","Row 17","Calculation Value",60,"Hour value"]
["Cert III Educators","Row 17","Criteria Value",30.4,"Max Contact Hours for Cert III Educators"]
["Cert III Educators","Row 17","Criteria Value",38,"Max Hours per week"]
["Cert III Educators","Row 17","Calculation Value",4]
["Cert III Educators","Row 17","Calculation Value",60,"Hour value"]
["Activity Group Leaders","Row 16","Criteria Value",25.5,"Max Contact Hours for Activity Group Leaders"]
{"$rows_left_out":14}
{"sheet":"Teachers","index":2,"n_rows":44,"n_cols":8,"rows_kept":44,"cut":false,"hidden":false,"merged":[[31,3,31,4]]}
[]
[null,null,"Annual Salary Costs: TEACHERS",null,null,null,null,"2023-10-26"]
[]
[]
[null,"Member / Service Name:",{"$f":"'Main Dashboard'!$C$5","v":0},null,"Weeks in Period:",{"$f":"'Main Dashboard'!$F$5","v":0}]
[]
[null,"For Period / FY Beginning:",{"$f":"'Main Dashboard'!$C$7","v":"00:00:00"},null,"Term Weeks in Period:",{"$f":"'Main Dashboard'!$F$7","v":0}]
[]
[null,"Teacher (Name):"]
[null,"Hourly Rate"]
[null,"Increment Date"]
[null,"New Hourly Rate"]
[null,"Contact Hours"]
[null,"Four Year Old"]
[null,"Three Year Old"]
{"$rows_left_out":30}
{"sheet":"Diploma Educators","index":3,"n_rows":47,"n_cols":8,"rows_kept":47,"cut":false,"hidden":false,"merged":[[34,3,34,5]]}
[]
[null,null,"Annual Salary Costs: Diploma Educator",null,null,null,null,"2023-10-26"]
[]
[]
[null,"Member / Service Name:",{"$f":"'Main Dashboard'!$C$5","v":0},null,"Weeks in Period:",{"$f":"'Main Dashboard'!$F$5","v":0}]
[]
[null,"For Period / FY Beginning:",{"$f":"'Main Dashboard'!$C$7","v":"00:00:00"},null,"Term Weeks in Period:",{"$f":"'Main Dashboard'!$F$7","v":0}]
[]
[null,"Diploma Educator (Name):"]
[null,"Hourly Rate"]
[null,"Increment Date"]
[null,"New Hourly Rate"]
[null,"Contact Hours"]
[null,"Four Year Old"]
[null,"Three Year Old"]
{"$rows_left_out":33}
{"sheet":"Teacher Index","index":4,"n_rows":37,"n_cols":8,"rows_kept":37,"cut":false,"hidden":false,"merged":[]}
[]
[null,null,"Teacher Index",null,null,null,null,"2023-10-26"]
[]
[]
[null,"Member / Service Name:",{"$f":"'Main Dashboard'!$C$5","v":0},null,"Weeks in Period:",{"$f":"'Main Dashboard'!$F$5","v":0}]
[]
[null,"For Period / FY Beginning:",{"$f":"'Main Dashboard'!$C$7","v":"00:00:00"},null,"Term Weeks in Period:",{"$f":"'Main Dashboard'!$F$7","v":0}]
[]
[null,"Teachers",{"$f":"Teachers!C$9","v":0},{"$f":"Teachers!D$9","v":0},{"$f":"Teachers!E$9","v":0},{"$f":"Teachers!F$9","v":0},{"$f":"Teachers!G$9","v":0},{"$f":"Teachers!H$9","v":0}]
[null,"Total Weekly Hours",{"$f":"Teachers!C$18","v":0},{"$f":"Teachers!D$18","v":0},{"$f":"Teachers!E$18","v":0},{"$f":"Teachers!F$18","v":0},{"$f":"Teachers!G$18","v":0},{"$f":"Teachers!H$18","v":0}]
[null,"Maximum Workload Index",{"$f":"ROUNDUP(C$10*765/38,0)","v":0},0,0,0,0,0]
[null,""]
[null,"Hours, Session 1"]
[null,"Children, Session 1"]
[null,""]
{"$rows_left_out":23}
{"sheet":"Cert III Educators","index":5,"n_rows":47,"n_cols":8,"rows_kept":47,"cut":false,"hidden":false,"merged":[[34,3,34,5]]}
[]
[null,null,"Annual Salary Costs: Cert III Educator",null,null,null,null,"2023-10-26"]
[]
[]
[null,"Member / Service Name:",{"$f":"'Main Dashboard'!$C$5","v":0},null,"Weeks in Period:",{"$f":"'Main Dashboard'!$F$5","v":0}]
[]
[null,"For Period / FY Beginning:",{"$f":"'Main Dashboard'!$C$7","v":"00:00:00"},null,"Term Weeks in Period:",{"$f":"'Main Dashboard'!$F$7","v":0}]
[]
[null,"Cert III Educator (Name):"]
[null,"Hourly Rate"]
[null,"Increment Date"]
[null,"New Hourly Rate"]
[null,"Contact Hours"]
[null,"Four Year Old"]
[null,"Three Year Old"]
{"$rows_left_out":33}
{"sheet":"Activity Group Leaders","index":6,"n_rows":46,"n_cols":8,"rows_kept":46,"cut":false,"hidden":false,"merged":[[33,3,33,5]]}
[]
[null,null,"Annual Salary Costs: Activity Group Leaders",null,null,null,null,"2023-10-26"]
[]
[]
[null,"Member / Service Name:",{"$f":"'Main Dashboard'!$C$5","v":0},null,"Weeks in Period:",{"$f":"'Main Dashboard'!$F$5","v":0}]
[]
[null,"For Period / FY Beginning:",{"$f":"'Main Dashboard'!$C$7","v":"00:00:00"},null,"Term Weeks in Period:",{"$f":"'Main Dashboard'!$F$7","v":0}]
[]
[null,"Act. Grp. Leaders (Name):"]
[null,"Hourly Rate"]
[null,"Increment Date"]
[null,"New Hourly Rate"]
[null,"Contact Hours"]
[null,"Four Year Old"]
[null,"Three Year Old"]
{"$rows_left_out":32}
{"sheet":"Other Staff","index":7,"n_rows":40,"n_cols":8,"rows_kept":40,"cut":false,"hidden":false,"merged":[[26,3,26,5]]}
[]
[null,null,"Annual Salary Costs: Other Staff",null,null,null,null,"2023-10-26"]
[]
[]
[null,"Member / Service Name:",{"$f":"'Main Dashboard'!$C$5","v":0},null,"Weeks in Period:",{"$f":"'Main Dashboard'!$F$5","v":0}]
[]
[null,"For Period / FY Beginning:",{"$f":"'Main Dashboard'!$C$7","v":"00:00:00"},null,"Term Weeks in Period:",{"$f":"'Main Dashboard'!$F$7","v":0}]
[]
[null,"Other Staff (Name):"]
[null,"Role Description:"]
[null,"Hourly Rate"]
[null,"Increment Date"]
[null,"New Hourly Rate"]
[null,"Support Allocation (Hours)"]
[null,"Four Year Old"]
{"$rows_left_out":26}
{"sheet":"Holiday Programs","index":8,"n_rows":41,"n_cols":9,"rows_kept":41,"cut":false,"hidden":false,"merged":[[23,1,23,2],[26,1,26,2],[29,1,29,2],[30,1,30,2],[17,1,17,2],[18,1,18,2],[19,1,19,2],[20,1,20,2],[21,1,21,2],[39,1,39,2],[40,1,40,2],[31,1,31,2],[32,1,32,2],[33,1,33,2],[34,1,34,2],[35,1,35,2],[38,1,38,2]]}
[]
[null,null,"Holiday Programs",null,null,null,null,null,"2023-10-26"]
[]
[]
[null,"Member / Service Name:",{"$f":"'Main Dashboard'!$C$5","v":0},null,"Weeks in Period:",{"$f":"'Main Dashboard'!$F$5","v":0}]
[]
[null,"For Period / FY Beginning:",{"$f":"'Main Dashboard'!$C$7","v":"00:00:00"},null,"Term Weeks in Period:",{"$f":"'Main Dashboard'!$F$7","v":0}]
[]
[]
[null,"PROFILE","Weekly Hours","Number of Children","Weeks of Operation","Hourly Rate","Gross Income"]
[null,"Program 1 ",null,null,null,null,{"$f":"ROUND($F11*$E11*$D11*$C11,0)","v":0}]
[null,"Program 2 ",null,null,null,null,{"$f":"ROUND($F12*$E12*$D12*$C12,0)","v":0}]
[null,"Program 3 ",null,null,null,null,{"$f":"ROUND($F13*$E13*$D13*$C13,0)","v":0}]
[null,"Program 4",null,null,null,null,{"$f":"ROUND($F14*$E14*$D14*$C14,0)","v":0}]
[null,null,null,null,null,"Total income   ",{"$f":"SUM($G$11:$G$14)","v":0}]
{"$rows_left_out":27}
{"sheet":"Day Care Programs","index":9,"n_rows":41,"n_cols":9,"rows_kept":41,"cut":false,"hidden":false,"merged":[[23,1,23,2],[26,1,26,2],[29,1,29,2],[30,1,30,2],[17,1,17,2],[18,1,18,2],[19,1,19,2],[20,1,20,2],[21,1,21,2],[39,1,39,2],[40,1,40,2],[31,1,31,2],[32,1,32,2],[33,1,33,2],[34,1,34,2],[35,1,35,2],[38,1,38,2]]}
[]
[null,null,"Day Care Programs",null,null,null,null,null,"2023-10-26"]
[]
[]
[null,"Member / Service Name:",{"$f":"'Main Dashboard'!$C$5","v":0},null,"Weeks in Period:",{"$f":"'Main Dashboard'!$F$5","v":0}]
[]
[null,"For Period / FY Beginning:",{"$f":"'Main Dashboard'!$C$7","v":"00:00:00"},null,"Term Weeks in Period:",{"$f":"'Main Dashboard'!$F$7","v":0}]
[]
[]
[null,"PROFILE","Weekly Hours","Number of Children","Weeks of Operation","Hourly Rate","Gross Income"]
[null,"Program 1 ",null,null,null,null,{"$f":"ROUND($F11*$E11*$D11*$C11,0)","v":0}]
[null,"Program 2 ",null,null,null,null,{"$f":"ROUND($F12*$E12*$D12*$C12,0)","v":0}]
[null,"Program 3 ",null,null,null,null,{"$f":"ROUND($F13*$E13*$D13*$C13,0)","v":0}]
[null,"Program 4",null,null,null,null,{"$f":"ROUND($F14*$E14*$D14*$C14,0)","v":0}]
[null,null,null,null,null,"Total income   ",{"$f":"SUM($G$11:$G$14)","v":0}]
{"$rows_left_out":27}
{"sheet":"Budget","index":10,"n_rows":74,"n_cols":11,"rows_kept":74,"cut":false,"hidden":false,"merged":[[67,1,67,3],[12,1,12,2],[14,1,14,2],[17,1,17,2],[18,1,18,2],[19,1,19,2],[20,1,20,2],[21,1,21,2],[22,1,22,2],[31,1,31,2],[32,1,32,2],[33,1,33,2],[34,1,34,2],[35,1,35,2],[37,1,37,2],[38,1,38,2],[63,1,63,2],[24,1,24,2],[62,1,62,2],[61,1,61,2],[50,1,50,2],[64,1,64,2],[23,1,23,2],[26,1,26,2],[27,1,27,2],[56,1,56,2],[57,1,57,2],[58,1,58,2],[59,1,59,2],[60,1,60,2],[51,1,51,2],[52,1,52,2],[53,1,53,2],[54,1,54,2],[55,1,55,2],[46,1,46,2],[25,1,25,2],[1,2,1,7],[13,1,13,2],[47,1,47,2],[48,1,48,2],[49,1,49,2],[41,1,41,2],[42,1,42,2],[43,1,43,2],[44,1,44,2],[45,1,45,2],[36,1,36,2],[39,1,39,2],[40,1,40,2],[15,1,15,2],[16,1,16,2]]}
[]
[null,null,{"$f":"\"FINANCIAL BUDGET (\"&Profile!$J$3&\", \"&Profile!$I$7&\")\"","v":"FINANCIAL BUDGET (Standard, Table 1 - Services operating under the Early Childhood Enterprise Agreements and do not opt in to Free Kinder)"},null,null,null,null,null,null,null,"2023-10-26"]
[]
[]
[null,null,"Member / Service Name:",{"$f":"'Main Dashboard'!$C$5","v":0},null,null,"Weeks in Period:",{"$f":"'Main Dashboard'!$F$5","v":0}]
[]
[null,null,"For Period / FY Beginning:",{"$f":"'Main Dashboard'!$C$7","v":"00:00:00"},null,null,"Term Weeks in Period:",{"$f":"'Main Dashboard'!$F$7","v":0}]
[]
[]
[null,"Budget"]
[]
[null,"Income",null,"Apportion?","Total","4 YO","3 YO","Other","Day Care","Holiday","% of Total Inc."]
[null,"DE Per Capita (Including Ratio Supplement Where Applicable)",null,null,{"$f":"SUM($F13:$J13)","v":0},{"$f":"Profile!$F$16*IF(Profile!$J$3=\"Standard\",Profile!$J$42,Profile!$J$43)+Profile!$U$16","v":0},{"$f":"Profile!$I$23+Profile!$U$23+Profile!$V$23","v":0},null,null,null,{"$f":"IFERROR($E13/$E$29,0)","v":0}]
[null,"Free Kinder Funding",null,null,0,{"$f":"Profile!$J$16","v":0},{"$f":"Profile!$J$23","v":0},null,null,null,{"$f":"IFERROR($E14/$E$29,0)","v":0}]
[null,"DE Teacher Supplement",null,null,0,{"$f":"Profile!$G$16","v":0},{"$f":"Profile!$G$23","v":0},null,null,null,0]
{"$rows_left_out":60}
{"sheet":"Profile","index":11,"n_rows":47,"n_cols":25,"rows_kept":47,"cut":false,"hidden":false,"merged":[[6,8,6,12],[34,1,34,2]]}
[]
[null,null,"Member Service Profile",null,null,null,null,null,"Grant Supplement",null,null,null,null,null,null,null,"2023-10-26"]
[null,null,null,null,null,null,null,null,"Location Type:","Standard"]
[]
[null,null,"Member / Service Name:",{"$f":"'Main Dashboard'!$C$5","v":0},null,"Weeks in Period:",{"$f":"'Main Dashboard'!$F$5","v":0},null,"Teacher Grants & Supplements"]
[null,null,null,null,null,null,null,null,"IMPORTANT: Select below the correct funding model under which this Kindergarten operates"]
[null,null,"For Period / FY Beginning:",{"$f":"'Main Dashboard'!$C$7","v":"00:00:00"},null,"Term Weeks in Period:",{"$f":"'Main Dashboard'!$F$7","v":0},null,"Table 1 - Services operating under the Early Childhood Enterprise Agreements and do not opt in to Free Kinder",null,null,null,null,null,{"$f":"VLOOKUP($I$7,'2025 Funding Rates'!$B$8:$I$11,8,FALSE)","v":"T1"}]
[]
[]
[null,"4 Year Olds",null,"Teacher Level \n(If more than 2.5)","Hours Per Week","Enrolled Children","Teacher Supplement","Cost Units",null,"Free Kinder Funding","# Child. Elig. for KFS","Term Fee","Suggested Term Fee","KFS  Add On","Fee Policy KFS Add On","Gap Fee","Hourly Rate","Hourly Add On","Fees Total","Add on Total","Ratio Supp.","KFS Supp.","KFS Total","Funded Hours","KFS Rate"]
[null,"Group A","4yo","L 2.5 Supplement",null,null,{"$f":"IFERROR(IF($D11=\"L 2.5 Supplement\",VLOOKUP($F11,Supp_2.4,IF($J$3=\"Standard\",2,3),FALSE),IF($D11=\"L 3.1 Supplement\",VLOOKUP($F11,Supp_2.5,IF($J$3=\"Standard\",2,3),FALSE),IF($D11=\"L 3.2-3.6 Supplement\",VLOOKUP($F11,Supp_3,IF($J$3=\"Standard\",2,3),FALSE),0))),0)","v":0},{"$f":"IF(OR($O$7=\"T3\",$O$7=\"T4\"),$E11*$F$11,$E11*($F11-$K11))","v":0},null,{"$f":"IF(OR(Profile!$O$7=\"T3\",Profile!$O$7=\"T4\"),$J$47*$F11,0)","v":0},null,null,{"$f":"IF(OR($O$7=\"T3\",$O$7=\"T4\"),0,IF($H$16=0,0,$E11*(Budget!$F$66-Budget!$F$29+Budget!$F$19+Budget!$F$15)/$H$16/4/(1-$C$45)))","v":0},null,{"$f":"IF(OR($O$7=\"T3\",$O$7=\"T4\"),0,(IF($P11<$R11,$P11,$R11))/4)","v":0},{"$f":"IF(OR($O$7=\"T3\",$O$7=\"T4\"),0,IF($E11>$X11,$L11*4-$Y11,0))","v":0},{"$f":"IF(OR($O$7=\"T3\",$O$7=\"T4\"),0,IF($E11=0,0,ROUND($L11*4/$E11,0)))","v":0},{"$f":"IF(OR($O$7=\"T3\",$O$7=\"T4\"),0,$Q11*($E11-$X11))","v":0},{"$f":"IF(OR($O$7=\"T3\",$O$7=\"T4\"),0,ROUND(4*($F11-$K11)*$L11,0))","v":0},{"$f":"IF(OR($O$7=\"T3\",$O$7=\"T4\"),0,ROUND(4*$K11*$N11,0))","v":0},{"$f":"IF($F11-22>0,$J$36*$F11,0)","v":0},{"$f":"IF(OR($O$7=\"T3\",$O$7=\"T4\"),0,IF($K11-22>0,$J$38*($K11-22),0))","v":0},{"$f":"IF(OR($O$7=\"T3\",$O$7=\"T4\"),0,$K11*$Y11)","v":0},{"$f":"IF($E11<15,15*($E11/15),15)","v":0},{"$f":"IF(OR($O$7=\"T3\",$O$7=\"T4\"),0,$J$44)","v":2627}]
[null,"Group B","4yo",null,null,null,{"$f":"IFERROR(IF($D12=\"L 2.5 Supplement\",VLOOKUP($F12,Supp_2.4,IF($J$3=\"Standard\",2,3),FALSE),IF($D12=\"L 3.1 Supplement\",VLOOKUP($F12,Supp_2.5,IF($J$3=\"Standard\",2,3),FALSE),IF($D12=\"L 3.2-3.6 Supplement\",VLOOKUP($F12,Supp_3,IF($J$3=\"Standard\",2,3),FALSE),0))),0)","v":0},{"$f":"IF(OR($O$7=\"T3\",$O$7=\"T4\"),$E12*$F$11,$E12*($F12-$K12))","v":0},null,{"$f":"IF(OR(Profile!$O$7=\"T3\",Profile!$O$7=\"T4\"),$J$47*$F12,0)","v":0},null,null,{"$f":"IF(OR($O$7=\"T3\",$O$7=\"T4\"),0,IF($H$16=0,0,$E12*(Budget!$F$66-Budget!$F$29+Budget!$F$19+Budget!$F$15)/$H$16/4/(1-$C$45)))","v":0},null,{"$f":"IF(OR($O$7=\"T3\",$O$7=\"T4\"),0,(IF($P12<$R12,$P12,$R12))/4)","v":0},{"$f":"IF(OR($O$7=\"T3\",$O$7=\"T4\"),0,IF($E12>$X12,$L12*4-$Y12,0))","v":0},{"$f":"IF(OR($O$7=\"T3\",$O$7=\"T4\"),0,IF($E12=0,0,ROUND($L12*4/$E12,0)))","v":0},{"$f":"IF(OR($O$7=\"T3\",$O$7=\"T4\"),0,$Q12*($E12-$X12))","v":0},{"$f":"IF(OR($O$7=\"T3\",$O$7=\"T4\"),0,ROUND(4*($F12-$K12)*$L12,0))","v":0},{"$f":"IF(OR($O$7=\"T3\",$O$7=\"T4\"),0,ROUND(4*$K12*$N12,0))","v":0},{"$f":"IF($F12-22>0,$J$36*$F12,0)","v":0},{"$f":"IF(OR($O$7=\"T3\",$O$7=\"T4\"),0,IF($K12-22>0,$J$38*($K12-22),0))","v":0},{"$f":"IF(OR($O$7=\"T3\",$O$7=\"T4\"),0,$K12*$Y12)","v":0},{"$f":"IF($E12<15,15*($E12/15),15)","v":0},{"$f":"IF(OR($O$7=\"T3\",$O$7=\"T4\"),0,$J$44)","v":2627}]
[null,"Group C","4yo",null,null,null,{"$f":"IFERROR(IF($D13=\"L 2.5 Supplement\",VLOOKUP($F13,Supp_2.4,IF($J$3=\"Standard\",2,3),FALSE),IF($D13=\"L 3.1 Supplement\",VLOOKUP($F13,Supp_2.5,IF($J$3=\"Standard\",2,3),FALSE),IF($D13=\"L 3.2-3.6 Supplement\",VLOOKUP($F13,Supp_3,IF($J$3=\"Standard\",2,3),FALSE),0))),0)","v":0},{"$f":"IF(OR($O$7=\"T3\",$O$7=\"T4\"),$E13*$F$11,$E13*($F13-$K13))","v":0},null,{"$f":"IF(OR(Profile!$O$7=\"T3\",Profile!$O$7=\"T4\"),$J$47*$F13,0)","v":0},null,null,{"$f":"IF(OR($O$7=\"T3\",$O$7=\"T4\"),0,IF($H$16=0,0,$E13*(Budget!$F$66-Budget!$F$29+Budget!$F$19+Budget!$F$15)/$H$16/4/(1-$C$45)))","v":0},null,{"$f":"IF(OR($O$7=\"T3\",$O$7=\"T4\"),0,(IF($P13<$R13,$P13,$R13))/4)","v":0},{"$f":"IF(OR($O$7=\"T3\",$O$7=\"T4\"),0,IF($E13>$X13,$L13*4-$Y13,0))","v":0},{"$f":"IF(OR($O$7=\"T3\",$O$7=\"T4\"),0,IF($E13=0,0,ROUND($L13*4/$E13,0)))","v":0},{"$f":"IF(OR($O$7=\"T3\",$O$7=\"T4\"),0,$Q13*($E13-$X13))","v":0},{"$f":"IF(OR($O$7=\"T3\",$O$7=\"T4\"),0,ROUND(4*($F13-$K13)*$L13,0))","v":0},{"$f":"IF(OR($O$7=\"T3\",$O$7=\"T4\"),0,ROUND(4*$K13*$N13,0))","v":0},{"$f":"IF($F13-22>0,$J$36*$F13,0)","v":0},{"$f":"IF(OR($O$7=\"T3\",$O$7=\"T4\"),0,IF($K13-22>0,$J$38*($K13-22),0))","v":0},{"$f":"IF(OR($O$7=\"T3\",$O$7=\"T4\"),0,$K13*$Y13)","v":0},{"$f":"IF($E13<15,15*($E13/15),15)","v":0},{"$f":"IF(OR($O$7=\"T3\",$O$7=\"T4\"),0,$J$44)","v":2627}]
[null,"Group D","4yo",null,null,null,{"$f":"IFERROR(IF($D14=\"L 2.5 Supplement\",VLOOKUP($F14,Supp_2.4,IF($J$3=\"Standard\",2,3),FALSE),IF($D14=\"L 3.1 Supplement\",VLOOKUP($F14,Supp_2.5,IF($J$3=\"Standard\",2,3),FALSE),IF($D14=\"L 3.2-3.6 Supplement\",VLOOKUP($F14,Supp_3,IF($J$3=\"Standard\",2,3),FALSE),0))),0)","v":0},{"$f":"IF(OR($O$7=\"T3\",$O$7=\"T4\"),$E14*$F$11,$E14*($F14-$K14))","v":0},null,{"$f":"IF(OR(Profile!$O$7=\"T3\",Profile!$O$7=\"T4\"),$J$47*$F14,0)","v":0},null,null,{"$f":"IF(OR($O$7=\"T3\",$O$7=\"T4\"),0,IF($H$16=0,0,$E14*(Budget!$F$66-Budget!$F$29+Budget!$F$19+Budget!$F$15)/$H$16/4/(1-$C$45)))","v":0},null,{"$f":"IF(OR($O$7=\"T3\",$O$7=\"T4\"),0,(IF($P14<$R14,$P14,$R14))/4)","v":0},{"$f":"IF(OR($O$7=\"T3\",$O$7=\"T4\"),0,IF($E14>$X14,$L14*4-$Y14,0))","v":0},{"$f":"IF(OR($O$7=\"T3\",$O$7=\"T4\"),0,IF($E14=0,0,ROUND($L14*4/$E14,0)))","v":0},{"$f":"IF(OR($O$7=\"T3\",$O$7=\"T4\"),0,$Q14*($E14-$X14))","v":0},{"$f":"IF(OR($O$7=\"T3\",$O$7=\"T4\"),0,ROUND(4*($F14-$K14)*$L14,0))","v":0},{"$f":"IF(OR($O$7=\"T3\",$O$7=\"T4\"),0,ROUND(4*$K14*$N14,0))","v":0},{"$f":"IF($F14-22>0,$J$36*$F14,0)","v":0},{"$f":"IF(OR($O$7=\"T3\",$O$7=\"T4\"),0,IF($K14-22>0,$J$38*($K14-22),0))","v":0},{"$f":"IF(OR($O$7=\"T3\",$O$7=\"T4\"),0,$K14*$Y14)","v":0},{"$f":"IF($E14<15,15*($E14/15),15)","v":0},{"$f":"IF(OR($O$7=\"T3\",$O$7=\"T4\"),0,$J$44)","v":2627}]
[null,"Group E","4yo",null,null,null,{"$f":"IFERROR(IF($D15=\"L 2.5 Supplement\",VLOOKUP($F15,Supp_2.4,IF($J$3=\"Standard\",2,3),FALSE),IF($D15=\"L 3.1 Supplement\",VLOOKUP($F15,Supp_2.5,IF($J$3=\"Standard\",2,3),FALSE),IF($D15=\"L 3.2-3.6 Supplement\",VLOOKUP($F15,Supp_3,IF($J$3=\"Standard\",2,3),FALSE),0))),0)","v":0},{"$f":"IF(OR($O$7=\"T3\",$O$7=\"T4\"),$E15*$F$11,$E15*($F15-$K15))","v":0},null,{"$f":"IF(OR(Profile!$O$7=\"T3\",Profile!$O$7=\"T4\"),$J$47*$F15,0)","v":0},null,null,{"$f":"IF(OR($O$7=\"T3\",$O$7=\"T4\"),0,IF($H$16=0,0,$E15*(Budget!$F$66-Budget!$F$29+Budget!$F$19+Budget!$F$15)/$H$16/4/(1-$C$45)))","v":0},null,{"$f":"IF(OR($O$7=\"T3\",$O$7=\"T4\"),0,(IF($P15<$R15,$P15,$R15))/4)","v":0},{"$f":"IF(OR($O$7=\"T3\",$O$7=\"T4\"),0,IF($E15>$X15,$L15*4-$Y15,0))","v":0},{"$f":"IF(OR($O$7=\"T3\",$O$7=\"T4\"),0,IF($E15=0,0,ROUND($L15*4/$E15,0)))","v":0},{"$f":"IF(OR($O$7=\"T3\",$O$7=\"T4\"),0,$Q15*($E15-$X15))","v":0},{"$f":"IF(OR($O$7=\"T3\",$O$7=\"T4\"),0,ROUND(4*($F15-$K15)*$L15,0))","v":0},{"$f":"IF(OR($O$7=\"T3\",$O$7=\"T4\"),0,ROUND(4*$K15*$N15,0))","v":0},{"$f":"IF($F15-22>0,$J$36*$F15,0)","v":0},{"$f":"IF(OR($O$7=\"T3\",$O$7=\"T4\"),0,IF($K15-22>0,$J$38*($K15-22),0))","v":0},{"$f":"IF(OR($O$7=\"T3\",$O$7=\"T4\"),0,$K15*$Y15)","v":0},{"$f":"IF($E15<15,15*($E15/15),15)","v":0},{"$f":"IF(OR($O$7=\"T3\",$O$7=\"T4\"),0,$J$44)","v":2627}]
{"$rows_left_out":33}
{"sheet":"Grants","index":12,"n_rows":205,"n_cols":17,"rows_kept":205,"cut":false,"hidden":false,"merged":[[3,10,4,10],[3,14,4,14],[3,6,4,6],[3,1,4,1]]}
[]
[null,"GRANTS CALCULATION TABLES",null,null,null,null,null,null,null,null,null,null,null,null,null,null,"2023-10-26"]
[]
[null,"Children UA Grant","Metro","Rural","Small Rural",null,"Children Supp 2.5","Metro","Rural",null,"Children Supp 3.1","Metro","Rural",null,"Children Supp 3.2 - 3.6","Metro","Rural"]
[null,null,{"$f":"Profile!$J$42","v":4339},{"$f":"Profile!$J$43","v":5366},{"$f":"$D$5","v":5366},null,null,{"$f":"Profile!$F$36","v":282},{"$f":"Profile!$F$37","v":349},null,null,{"$f":"Profile!$F$40","v":494},{"$f":"Profile!$F$41","v":609},null,null,{"$f":"Profile!$F$44","v":705},{"$f":"Profile!$F$45","v":874}]
[null,1,{"$f":"$B6*C$5","v":4339},{"$f":"$B6*D$5","v":5366},{"$f":"$B6*E$5","v":5366},null,1,{"$f":"$G6*H$5","v":282},{"$f":"$G6*I$5","v":349},null,1,{"$f":"$K6*L$5","v":494},{"$f":"$K6*M$5","v":609},null,1,{"$f":"$O6*P$5","v":705},{"$f":"$O6*Q$5","v":874}]
[null,2,{"$f":"$B7*C$5","v":8678},10732,10732,null,2,{"$f":"$G7*H$5","v":564},698,null,2,{"$f":"$K7*L$5","v":988},1218,null,2,{"$f":"$O7*P$5","v":1410},1748]
[null,3,13017,16098,16098,null,3,846,1047,null,3,1482,1827,null,3,2115,2622]
[null,4,17356,21464,21464,null,4,1128,1396,null,4,1976,2436,null,4,2820,3496]
[null,5,21695,26830,26830,null,5,1410,1745,null,5,2470,3045,null,5,3525,4370]
[null,6,26034,32196,32196,null,6,1692,2094,null,6,2964,3654,null,6,4230,5244]
[null,7,30373,37562,37562,null,7,1974,2443,null,7,3458,4263,null,7,4935,6118]
[null,8,34712,42928,42928,null,8,2256,2792,null,8,3952,4872,null,8,5640,6992]
[null,9,39051,48294,48294,null,9,2538,3141,null,9,4446,5481,null,9,6345,7866]
[null,10,43390,53660,53660,null,10,2820,3490,null,10,4940,6090,null,10,7050,8740]
{"$rows_left_out":191}
{"sheet":"2025 Funding Rates","index":13,"n_rows":194,"n_cols":9,"rows_kept":194,"cut":false,"hidden":false,"merged":[[7,1,7,5],[8,1,8,5],[9,1,9,5],[10,1,10,5]]}
[]
[null,"2025 Kindergarten Funding rates"]
[]
[null,"Kindergarten providers can find which funding rates table is applicable to them by identifying whether they have"]
[null,"opted in to Free Kinder or not and whether they operate under either of the Victorian Early Childhood Teachers’"]
[null,"and Educators’ Agreement 2020 (VECTEA) and the Early Education Employees’ Agreement 2020 (EEEA) or not."]
[]
[null,"Table 1 - Services operating under the Early Childhood Enterprise Agreements and do not opt in to Free Kinder",null,null,null,null,null,null,"T1"]
[null,"Table 2 - Services not operating under the Early Childhood Enterprise Agreements and do not opt in to Free Kinder",null,null,null,null,null,null,"T2"]
[null,"Table 3 - Services operating under the Early Childhood Enterprise Agreements and opt-in to Free Kinder",null,null,null,null,null,null,"T3"]
[null,"Table 4 - Services not operating under the Early Childhood Enterprise Agreements and opt-in to Free Kinder",null,null,null,null,null,null,"T4"]
[]
[null,null,null,null,null,null,null,null,"Teacher Level Dropdown"]
[null,null,null,null,null,null,null,null,"L 2.5 Supplement"]
[null,null,null,null,null,null,null,null,"L 3.1 Supplement"]
{"$rows_left_out":179}